{"text_format":"1","workbook":"xlsx","n_sheets":16,"sheets":["Worksheet","January","February","March","April","May","June","July","August","September","October","November","December","Summary","EFC Table","DWR_LWSP_Data_Systems"],"not_rendered":{"charts":0,"images":3,"macros":1,"external_links":0,"defined_names":2,"comments":0,"pivot_tables":0},"unopened":[],"bounds":{"document_bytes":16777216,"sheet_cells":100000,"rows_first":2000,"rows_last":500,"rows_between":2000,"halvings":0,"cell_chars":16384,"cell_head_chars":4096},"cells_cut":0,"cells_raw":0,"read":"whole","date_system":"1900"}

{"sheet":"Worksheet","index":0,"n_rows":176,"n_cols":9,"rows_kept":176,"cut":false,"hidden":false,"merged":[[4,3,4,5],[2,1,2,5]]}
["Local Water Supply Plan Completion Assistance Tool v6.0"]
[]
["Water System Name:",{"$f":"IF(B4<>0,VLOOKUP(B4,DWR_LWSP_Data_Systems!A2:B702,2,FALSE),\"No Data\")","v":"No Data"}]
["PWSID#:"]
["Reporting Year:",null,null,"Full instructions for the LWSP can be found here:",null,null,"LWSP Instructions"]
[{"$f":"IF(B5<>0,IF(OR(MOD(B5,400)=0,AND(MOD(B5,4)=0,MOD(B5,100)<>0)),\"Leap Year\", \"Not a Leap Year\"),\"No Data\")","v":"No Data"},{"$f":"IF(B5<>0,365+IF(MOD(B5,4)=0,IF(MOD(B5,100)=0,IF(MOD(B5,400)=0,1,0),1),0),\"No Data\")","v":"No Data"}]
["Water Use by Type",null,null,{"$f":"D9+D10+D11+D12+D13","v":0},null,null,{"$f":"G9+G10+G11+G12","v":0}]
["Type of Use","Metered Connections","Gallons","Metered Average Use (MGD)","Non-Metered Connections","Estimated Gallons","Non-Metered Estimated Use (MGD)"]
["Residential",null,null,{"$f":"IF(C9>0,C9/1000000/$B$6,0)","v":0},null,null,{"$f":"IF(F9>0,F9/1000000/$B$6,0)","v":0}]
["Commercial",null,null,{"$f":"IF(C10>0,C10/1000000/$B$6,0)","v":0},null,null,{"$f":"IF(F10>0,F10/1000000/$B$6,0)","v":0}]
["Industrial",null,null,{"$f":"IF(C11>0,C11/1000000/$B$6,0)","v":0},null,null,0]
["Institutional",null,null,{"$f":"IF(C12>0,C12/1000000/$B$6,0)","v":0},null,null,0]
["System Process",null,null,{"$f":"IF(C13>0,C13/1000000/$B$6,0)","v":0}]
[]
[]
[]
[]
[]
["Water Sales",null,null,{"$f":"(IF(C21>0,D21*E21,0)+IF(C22>0,D22*E22,0)+IF(C23>0,D23*E23,0)+IF(C24>0,D24*E24,0)+IF(C25>0,D25*E25,0)+IF(C26>0,D26*E26,0)+IF(C27>0,D27*E27,0)+IF(C28>0,D28*E28,0)+IF(C29>0,D29*E29,0)+IF(C30>0,D30*E30,0)+IF(C31>0,D31*E31))/IF(A6=\"Leap Year\",366,365)","v":0}]
["Purchaser","PWSID","Gallons Sold","Average Daily Sold (MGD)","Days Sold"]
{"$rows_left_out":157}
{"sheet":"January","index":1,"n_rows":35,"n_cols":8,"rows_kept":35,"cut":false,"hidden":true,"merged":[]}
["Monthly Withdrawals & Purchases"]
["Source Type","W1","W2","W3","P1","P2","S","Total Gal (Day)"]
["Date","Thousand Gal","Thousand Gal","Thousand Gal","Thousand Gal","Thousand Gal","Thousand Gal"]
[1,null,null,null,null,null,null,{"$f":"SUM(B4:G4)*1000","v":0}]
[{"$f":"A4+1","v":2},null,null,null,null,null,null,{"$f":"SUM(B5:G5)*1000","v":0}]
[{"$f":"A5+1","v":3},null,null,null,null,null,null,0]
[4,null,null,null,null,null,null,0]
[5,null,null,null,null,null,null,0]
[6,null,null,null,null,null,null,0]
[7,null,null,null,null,null,null,0]
[8,null,null,null,null,null,null,0]
[9,null,null,null,null,null,null,0]
[10,null,null,null,null,null,null,0]
[11,null,null,null,null,null,null,0]
[12,null,null,null,null,null,null,0]
[13,null,null,null,null,null,null,0]
[14,null,null,null,null,null,null,0]
[15,null,null,null,null,null,null,0]
[16,null,null,null,null,null,null,0]
[17,null,null,null,null,null,null,0]
{"$rows_left_out":16}
{"sheet":"February","index":2,"n_rows":35,"n_cols":8,"rows_kept":35,"cut":false,"hidden":true,"merged":[]}
["Monthly Withdrawals & Purchases"]
["Source Type",{"$f":"January!B2","v":"W1"},{"$f":"January!C2","v":"W2"},{"$f":"January!D2","v":"W3"},{"$f":"January!E2","v":"P1"},{"$f":"January!F2","v":"P2"},{"$f":"January!G2","v":"S"},"Total Gal (Day)"]
["Date","Thousand Gal","Thousand Gal","Thousand Gal","Thousand Gal","Thousand Gal","Thousand Gal"]
[1,null,null,null,null,null,null,{"$f":"SUM(B4:G4)*1000","v":0}]
[{"$f":"A4+1","v":2},null,null,null,null,null,null,{"$f":"SUM(B5:G5)*1000","v":0}]
[{"$f":"A5+1","v":3},null,null,null,null,null,null,0]
[4,null,null,null,null,null,null,0]
[5,null,null,null,null,null,null,0]
[6,null,null,null,null,null,null,0]
[7,null,null,null,null,null,null,0]
[8,null,null,null,null,null,null,0]
[9,null,null,null,null,null,null,0]
[10,null,null,null,null,null,null,0]
[11,null,null,null,null,null,null,0]
[12,null,null,null,null,null,null,0]
[13,null,null,null,null,null,null,0]
[14,null,null,null,null,null,null,0]
[15,null,null,null,null,null,null,0]
[16,null,null,null,null,null,null,0]
[17,null,null,null,null,null,null,0]
{"$rows_left_out":16}
{"sheet":"March","index":3,"n_rows":35,"n_cols":8,"rows_kept":35,"cut":false,"hidden":true,"merged":[]}
["Monthly Withdrawals & Purchases"]
["Source Type",{"$f":"January!B2","v":"W1"},{"$f":"January!C2","v":"W2"},{"$f":"January!D2","v":"W3"},{"$f":"January!E2","v":"P1"},{"$f":"January!F2","v":"P2"},{"$f":"January!G2","v":"S"},"Total Gal (Day)"]
["Date","Thousand Gal","Thousand Gal","Thousand Gal","Thousand Gal","Thousand Gal","Thousand Gal"]
[1,null,null,null,null,null,null,{"$f":"SUM(B4:G4)*1000","v":0}]
[{"$f":"A4+1","v":2},null,null,null,null,null,null,{"$f":"SUM(B5:G5)*1000","v":0}]
[{"$f":"A5+1","v":3},null,null,null,null,null,null,0]
[4,null,null,null,null,null,null,0]
[5,null,null,null,null,null,null,0]
[6,null,null,null,null,null,null,0]
[7,null,null,null,null,null,null,0]
[8,null,null,null,null,null,null,0]
[9,null,null,null,null,null,null,0]
[10,null,null,null,null,null,null,0]
[11,null,null,null,null,null,null,0]
[12,null,null,null,null,null,null,0]
[13,null,null,null,null,null,null,0]
[14,null,null,null,null,null,null,0]
[15,null,null,null,null,null,null,0]
[16,null,null,null,null,null,null,0]
[17,null,null,null,null,null,null,0]
{"$rows_left_out":16}
{"sheet":"April","index":4,"n_rows":35,"n_cols":8,"rows_kept":35,"cut":false,"hidden":true,"merged":[]}
["Monthly Withdrawals & Purchases"]
["Source Type",{"$f":"January!B2","v":"W1"},{"$f":"January!C2","v":"W2"},{"$f":"January!D2","v":"W3"},{"$f":"January!E2","v":"P1"},{"$f":"January!F2","v":"P2"},{"$f":"January!G2","v":"S"},"Total Gal (Day)"]
["Date","Thousand Gal","Thousand Gal","Thousand Gal","Thousand Gal","Thousand Gal","Thousand Gal"]
[1,null,null,null,null,null,null,{"$f":"SUM(B4:G4)*1000","v":0}]
[{"$f":"A4+1","v":2},null,null,null,null,null,null,{"$f":"SUM(B5:G5)*1000","v":0}]
[{"$f":"A5+1","v":3},null,null,null,null,null,null,0]
[4,null,null,null,null,null,null,0]
[5,null,null,null,null,null,null,0]
[6,null,null,null,null,null,null,0]
[7,null,null,null,null,null,null,0]
[8,null,null,null,null,null,null,0]
[9,null,null,null,null,null,null,0]
[10,null,null,null,null,null,null,0]
[11,null,null,null,null,null,null,0]
[12,null,null,null,null,null,null,0]
[13,null,null,null,null,null,null,0]
[14,null,null,null,null,null,null,0]
[15,null,null,null,null,null,null,0]
[16,null,null,null,null,null,null,0]
[17,null,null,null,null,null,null,0]
{"$rows_left_out":16}
{"sheet":"May","index":5,"n_rows":35,"n_cols":8,"rows_kept":35,"cut":false,"hidden":true,"merged":[]}
["Monthly Withdrawals & Purchases"]
["Source Type",{"$f":"January!B2","v":"W1"},{"$f":"January!C2","v":"W2"},{"$f":"January!D2","v":"W3"},{"$f":"January!E2","v":"P1"},{"$f":"January!F2","v":"P2"},{"$f":"January!G2","v":"S"},"Total Gal (Day)"]
["Date","Thousand Gal","Thousand Gal","Thousand Gal","Thousand Gal","Thousand Gal","Thousand Gal"]
[1,null,null,null,null,null,null,{"$f":"SUM(B4:G4)*1000","v":0}]
[{"$f":"A4+1","v":2},null,null,null,null,null,null,{"$f":"SUM(B5:G5)*1000","v":0}]
[{"$f":"A5+1","v":3},null,null,null,null,null,null,0]
[4,null,null,null,null,null,null,0]
[5,null,null,null,null,null,null,0]
[6,null,null,null,null,null,null,0]
[7,null,null,null,null,null,null,0]
[8,null,null,null,null,null,null,0]
[9,null,null,null,null,null,null,0]
[10,null,null,null,null,null,null,0]
[11,null,null,null,null,null,null,0]
[12,null,null,null,null,null,null,0]
[13,null,null,null,null,null,null,0]
[14,null,null,null,null,null,null,0]
[15,null,null,null,null,null,null,0]
[16,null,null,null,null,null,null,0]
[17,null,null,null,null,null,null,0]
{"$rows_left_out":16}
{"sheet":"June","index":6,"n_rows":35,"n_cols":8,"rows_kept":35,"cut":false,"hidden":true,"merged":[]}
["Monthly Withdrawals & Purchases"]
["Source Type",{"$f":"January!B2","v":"W1"},{"$f":"January!C2","v":"W2"},{"$f":"January!D2","v":"W3"},{"$f":"January!E2","v":"P1"},{"$f":"January!F2","v":"P2"},{"$f":"January!G2","v":"S"},"Total Gal (Day)"]
["Date","Thousand Gal","Thousand Gal","Thousand Gal","Thousand Gal","Thousand Gal","Thousand Gal"]
[1,null,null,null,null,null,null,{"$f":"SUM(B4:G4)*1000","v":0}]
[{"$f":"A4+1","v":2},null,null,null,null,null,null,{"$f":"SUM(B5:G5)*1000","v":0}]
[{"$f":"A5+1","v":3},null,null,null,null,null,null,0]
[4,null,null,null,null,null,null,0]
[5,null,null,null,null,null,null,0]
[6,null,null,null,null,null,null,0]
[7,null,null,null,null,null,null,0]
[8,null,null,null,null,null,null,0]
[9,null,null,null,null,null,null,0]
[10,null,null,null,null,null,null,0]
[11,null,null,null,null,null,null,0]
[12,null,null,null,null,null,null,0]
[13,null,null,null,null,null,null,0]
[14,null,null,null,null,null,null,0]
[15,null,null,null,null,null,null,0]
[16,null,null,null,null,null,null,0]
[17,null,null,null,null,null,null,0]
{"$rows_left_out":16}
{"sheet":"July","index":7,"n_rows":35,"n_cols":8,"rows_kept":35,"cut":false,"hidden":true,"merged":[]}
["Monthly Withdrawals & Purchases"]
["Source Type",{"$f":"January!B2","v":"W1"},{"$f":"January!C2","v":"W2"},{"$f":"January!D2","v":"W3"},{"$f":"January!E2","v":"P1"},{"$f":"January!F2","v":"P2"},{"$f":"January!G2","v":"S"},"Total Gal (Day)"]
["Date","Thousand Gal","Thousand Gal","Thousand Gal","Thousand Gal","Thousand Gal","Thousand Gal"]
[1,null,null,null,null,null,null,{"$f":"SUM(B4:G4)*1000","v":0}]
[{"$f":"A4+1","v":2},null,null,null,null,null,null,{"$f":"SUM(B5:G5)*1000","v":0}]
[{"$f":"A5+1","v":3},null,null,null,null,null,null,0]
[4,null,null,null,null,null,null,0]
[5,null,null,null,null,null,null,0]
[6,null,null,null,null,null,null,0]
[7,null,null,null,null,null,null,0]
[8,null,null,null,null,null,null,0]
[9,null,null,null,null,null,null,0]
[10,null,null,null,null,null,null,0]
[11,null,null,null,null,null,null,0]
[12,null,null,null,null,null,null,0]
[13,null,null,null,null,null,null,0]
[14,null,null,null,null,null,null,0]
[15,null,null,null,null,null,null,0]
[16,null,null,null,null,null,null,0]
[17,null,null,null,null,null,null,0]
{"$rows_left_out":16}
{"sheet":"August","index":8,"n_rows":35,"n_cols":8,"rows_kept":35,"cut":false,"hidden":true,"merged":[]}
["Monthly Withdrawals & Purchases"]
["Source Type",{"$f":"January!B2","v":"W1"},{"$f":"January!C2","v":"W2"},{"$f":"January!D2","v":"W3"},{"$f":"January!E2","v":"P1"},{"$f":"January!F2","v":"P2"},{"$f":"January!G2","v":"S"},"Total Gal (Day)"]
["Date","Thousand Gal","Thousand Gal","Thousand Gal","Thousand Gal","Thousand Gal","Thousand Gal"]
[1,null,null,null,null,null,null,{"$f":"SUM(B4:G4)*1000","v":0}]
[{"$f":"A4+1","v":2},null,null,null,null,null,null,{"$f":"SUM(B5:G5)*1000","v":0}]
[{"$f":"A5+1","v":3},null,null,null,null,null,null,0]
[4,null,null,null,null,null,null,0]
[5,null,null,null,null,null,null,0]
[6,null,null,null,null,null,null,0]
[7,null,null,null,null,null,null,0]
[8,null,null,null,null,null,null,0]
[9,null,null,null,null,null,null,0]
[10,null,null,null,null,null,null,0]
[11,null,null,null,null,null,null,0]
[12,null,null,null,null,null,null,0]
[13,null,null,null,null,null,null,0]
[14,null,null,null,null,null,null,0]
[15,null,null,null,null,null,null,0]
[16,null,null,null,null,null,null,0]
[17,null,null,null,null,null,null,0]
{"$rows_left_out":16}
{"sheet":"September","index":9,"n_rows":35,"n_cols":8,"rows_kept":35,"cut":false,"hidden":true,"merged":[]}
["Monthly Withdrawals & Purchases"]
["Source Type",{"$f":"January!B2","v":"W1"},{"$f":"January!C2","v":"W2"},{"$f":"January!D2","v":"W3"},{"$f":"January!E2","v":"P1"},{"$f":"January!F2","v":"P2"},{"$f":"January!G2","v":"S"},"Total Gal (Day)"]
["Date","Thousand Gal","Thousand Gal","Thousand Gal","Thousand Gal","Thousand Gal","Thousand Gal"]
[1,null,null,null,null,null,null,{"$f":"SUM(B4:G4)*1000","v":0}]
[{"$f":"A4+1","v":2},null,null,null,null,null,null,{"$f":"SUM(B5:G5)*1000","v":0}]
[{"$f":"A5+1","v":3},null,null,null,null,null,null,0]
[4,null,null,null,null,null,null,0]
[5,null,null,null,null,null,null,0]
[6,null,null,null,null,null,null,0]
[7,null,null,null,null,null,null,0]
[8,null,null,null,null,null,null,0]
[9,null,null,null,null,null,null,0]
[10,null,null,null,null,null,null,0]
[11,null,null,null,null,null,null,0]
[12,null,null,null,null,null,null,0]
[13,null,null,null,null,null,null,0]
[14,null,null,null,null,null,null,0]
[15,null,null,null,null,null,null,0]
[16,null,null,null,null,null,null,0]
[17,null,null,null,null,null,null,0]
{"$rows_left_out":16}
{"sheet":"October","index":10,"n_rows":35,"n_cols":8,"rows_kept":35,"cut":false,"hidden":true,"merged":[]}
["Monthly Withdrawals & Purchases"]
["Source Type",{"$f":"January!B2","v":"W1"},{"$f":"January!C2","v":"W2"},{"$f":"January!D2","v":"W3"},{"$f":"January!E2","v":"P1"},{"$f":"January!F2","v":"P2"},{"$f":"January!G2","v":"S"},"Total Gal (Day)"]
["Date","Thousand Gal","Thousand Gal","Thousand Gal","Thousand Gal","Thousand Gal","Thousand Gal"]
[1,null,null,null,null,null,null,{"$f":"SUM(B4:G4)*1000","v":0}]
[{"$f":"A4+1","v":2},null,null,null,null,null,null,{"$f":"SUM(B5:G5)*1000","v":0}]
[{"$f":"A5+1","v":3},null,null,null,null,null,null,0]
[4,null,null,null,null,null,null,0]
[5,null,null,null,null,null,null,0]
[6,null,null,null,null,null,null,0]
[7,null,null,null,null,null,null,0]
[8,null,null,null,null,null,null,0]
[9,null,null,null,null,null,null,0]
[10,null,null,null,null,null,null,0]
[11,null,null,null,null,null,null,0]
[12,null,null,null,null,null,null,0]
[13,null,null,null,null,null,null,0]
[14,null,null,null,null,null,null,0]
[15,null,null,null,null,null,null,0]
[16,null,null,null,null,null,null,0]
[17,null,null,null,null,null,null,0]
{"$rows_left_out":16}
{"sheet":"November","index":11,"n_rows":35,"n_cols":8,"rows_kept":35,"cut":false,"hidden":true,"merged":[]}
["Monthly Withdrawals & Purchases"]
["Source Type",{"$f":"January!B2","v":"W1"},{"$f":"January!C2","v":"W2"},{"$f":"January!D2","v":"W3"},{"$f":"January!E2","v":"P1"},{"$f":"January!F2","v":"P2"},{"$f":"January!G2","v":"S"},"Total Gal (Day)"]
["Date","Thousand Gal","Thousand Gal","Thousand Gal","Thousand Gal","Thousand Gal","Thousand Gal"]
[1,null,null,null,null,null,null,{"$f":"SUM(B4:G4)*1000","v":0}]
[{"$f":"A4+1","v":2},null,null,null,null,null,null,{"$f":"SUM(B5:G5)*1000","v":0}]
[{"$f":"A5+1","v":3},null,null,null,null,null,null,0]
[4,null,null,null,null,null,null,0]
[5,null,null,null,null,null,null,0]
[6,null,null,null,null,null,null,0]
[7,null,null,null,null,null,null,0]
[8,null,null,null,null,null,null,0]
[9,null,null,null,null,null,null,0]
[10,null,null,null,null,null,null,0]
[11,null,null,null,null,null,null,0]
[12,null,null,null,null,null,null,0]
[13,null,null,null,null,null,null,0]
[14,null,null,null,null,null,null,0]
[15,null,null,null,null,null,null,0]
[16,null,null,null,null,null,null,0]
[17,null,null,null,null,null,null,0]
{"$rows_left_out":16}
{"sheet":"December","index":12,"n_rows":35,"n_cols":8,"rows_kept":35,"cut":false,"hidden":true,"merged":[]}
["Monthly Withdrawals & Purchases"]
["Source Type",{"$f":"January!B2","v":"W1"},{"$f":"January!C2","v":"W2"},{"$f":"January!D2","v":"W3"},{"$f":"January!E2","v":"P1"},{"$f":"January!F2","v":"P2"},{"$f":"January!G2","v":"S"},"Total Gal (Day)"]
["Date","Thousand Gal","Thousand Gal","Thousand Gal","Thousand Gal","Thousand Gal","Thousand Gal"]
[1,null,null,null,null,null,null,{"$f":"SUM(B4:G4)*1000","v":0}]
[{"$f":"A4+1","v":2},null,null,null,null,null,null,{"$f":"SUM(B5:G5)*1000","v":0}]
[{"$f":"A5+1","v":3},null,null,null,null,null,null,0]
[4,null,null,null,null,null,null,0]
[5,null,null,null,null,null,null,0]
[6,null,null,null,null,null,null,0]
[7,null,null,null,null,null,null,0]
[8,null,null,null,null,null,null,0]
[9,null,null,null,null,null,null,0]
[10,null,null,null,null,null,null,0]
[11,null,null,null,null,null,null,0]
[12,null,null,null,null,null,null,0]
[13,null,null,null,null,null,null,0]
[14,null,null,null,null,null,null,0]
[15,null,null,null,null,null,null,0]
[16,null,null,null,null,null,null,0]
[17,null,null,null,null,null,null,0]
{"$rows_left_out":16}
{"sheet":"Summary","index":13,"n_rows":16,"n_cols":8,"rows_kept":16,"cut":false,"hidden":true,"merged":[]}
["Monthly Withdrawals & Purchases"]
["Source Type",{"$f":"January!B2","v":"W1"},{"$f":"January!C2","v":"W2"},{"$f":"January!D2","v":"W3"},{"$f":"January!E2","v":"P1"},{"$f":"January!F2","v":"P2"},{"$f":"January!G2","v":"S"},"Total Gal (Month)"]
["Month ","Total Gal","Total Gal","Total Gal","Total Gal","Total Gal","Total Gal"]
["January",{"$f":"January!B35","v":0},{"$f":"January!C35","v":0},{"$f":"January!D35","v":0},{"$f":"January!E35","v":0},{"$f":"January!F35","v":0},{"$f":"January!G35","v":0},{"$f":"SUM(B4:G4)","v":0}]
["February",{"$f":"February!B35","v":0},{"$f":"February!C35","v":0},{"$f":"February!D35","v":0},{"$f":"February!E35","v":0},{"$f":"February!F35","v":0},{"$f":"February!G35","v":0},{"$f":"SUM(B5:G5)","v":0}]
["March",{"$f":"March!B35","v":0},{"$f":"March!C35","v":0},{"$f":"March!D35","v":0},{"$f":"March!E35","v":0},{"$f":"March!F35","v":0},{"$f":"March!G35","v":0},0]
["April",{"$f":"April!B35","v":0},{"$f":"April!C35","v":0},{"$f":"April!D35","v":0},{"$f":"April!E35","v":0},{"$f":"April!F35","v":0},{"$f":"April!G35","v":0},0]
["May",{"$f":"May!B35","v":0},{"$f":"May!C35","v":0},{"$f":"May!D35","v":0},{"$f":"May!E35","v":0},{"$f":"May!F35","v":0},{"$f":"May!G35","v":0},0]
["June",{"$f":"June!B35","v":0},{"$f":"June!C35","v":0},{"$f":"June!D35","v":0},{"$f":"June!E35","v":0},{"$f":"June!F35","v":0},{"$f":"June!G35","v":0},0]
["July",{"$f":"July!B35","v":0},{"$f":"July!C35","v":0},{"$f":"July!D35","v":0},{"$f":"July!E35","v":0},{"$f":"July!F35","v":0},{"$f":"July!G35","v":0},0]
["August",{"$f":"August!B35","v":0},{"$f":"August!C35","v":0},{"$f":"August!D35","v":0},{"$f":"August!E35","v":0},{"$f":"August!F35","v":0},{"$f":"August!G35","v":0},0]
["September",{"$f":"September!B35","v":0},{"$f":"September!C35","v":0},{"$f":"September!D35","v":0},{"$f":"September!E35","v":0},{"$f":"September!F35","v":0},{"$f":"September!G35","v":0},0]
["October",{"$f":"October!B35","v":0},{"$f":"October!C35","v":0},{"$f":"October!D35","v":0},{"$f":"October!E35","v":0},{"$f":"October!F35","v":0},{"$f":"October!G35","v":0},0]
["November",{"$f":"November!B35","v":0},{"$f":"November!C35","v":0},{"$f":"November!D35","v":0},{"$f":"November!E35","v":0},{"$f":"November!F35","v":0},{"$f":"November!G35","v":0},0]
["December",{"$f":"December!B35","v":0},{"$f":"December!C35","v":0},{"$f":"December!D35","v":0},{"$f":"December!E35","v":0},{"$f":"December!F35","v":0},{"$f":"December!G35","v":0},0]
["Total Gal (Year)",{"$f":"SUM(B4:B15)","v":0},{"$f":"SUM(C4:C15)","v":0},0,0,0,0,{"$f":"SUM(H4:H15)","v":0}]

{"sheet":"EFC Table","index":14,"n_rows":504,"n_cols":9,"rows_kept":504,"cut":false,"hidden":true,"merged":[]}
[null,"EFC Data Tables Link","Sanchez, Melanie Nicole <msanchez@sog.unc.edu>"]
["Helper Column (system+water+inside)","System Name","Service Type ","Inside/ Outside","Operating Ratio (incl. Depreciation)","Estimated Service Pop","Residential Bills at Various Consumption Levels","Price (V Monthly Bill)"]
[{"$f":"B3&C3&D3","v":"AberdeenWaterInside"},"Aberdeen","Water","Inside",1.03,12241,"5,000 gallons (668 cf)",24.55]
[{"$f":"B4&C4&D4","v":"AhoskieWaterInside"},"Ahoskie","Water","Inside",1.1100000000000001,5479,"5,000 gallons (668 cf)",40.58]
["AlamanceWaterInside","Alamance","Water","Inside",0.75,1100,"5,000 gallons (668 cf)",37.85]
["AlbemarleWaterInside","Albemarle","Water","Inside",1.1200000000000001,17368,"5,000 gallons (668 cf)",27.46]
["AndrewsWaterInside","Andrews","Water","Inside",0.83,3284,"5,000 gallons (668 cf)",43]
["AngierWaterInside","Angier","Water","Inside",1.22,8468,"5,000 gallons (668 cf)",31.77]
["Anson CoWaterInside","Anson Co","Water","Inside",null,13771,"5,000 gallons (668 cf)",26.96]
["AnsonvilleWaterInside","Ansonville","Water","Inside",0.99,1262,"5,000 gallons (668 cf)",31.04]
["ApexWaterInside","Apex","Water","Inside",0.85,70272,"5,000 gallons (668 cf)",27.25]
["Aqua North CarolinaWaterInside","Aqua North Carolina","Water","Inside",null,187787,"5,000 gallons (668 cf)",52.6]
["Aqua North Carolina - Brookwood and LaGrangeWaterInside","Aqua North Carolina - Brookwood and LaGrange","Water","Inside",null,18022,"5,000 gallons (668 cf)",38.86]
["Aqua North Carolina - Fairways and Beau RivageWaterInside","Aqua North Carolina - Fairways and Beau Rivage","Water","Inside",null,115976,"5,000 gallons (668 cf)",16.309999999999999]
["ArchdaleWaterInside","Archdale","Water","Inside",1.24,12700,"5,000 gallons (668 cf)",32.35]
["AsheboroWaterInside","Asheboro","Water","Inside",0.89,27191,"5,000 gallons (668 cf)",31.5]
["AshevilleWaterInside","Asheville","Water","Inside",1.31,156720,"5,000 gallons (668 cf)",37.43]
["AtkinsonWaterInside","Atkinson","Water","Inside",null,301,"5,000 gallons (668 cf)",59]
["Atlantic BeachWaterInside","Atlantic Beach","Water","Inside",1.37,6380,"5,000 gallons (668 cf)",29.65]
["AulanderWaterInside","Aulander","Water","Inside",0.78,1438,"5,000 gallons (668 cf)",38.5]
{"$rows_left_out":485}
{"sheet":"DWR_LWSP_Data_Systems","index":15,"n_rows":704,"n_cols":8,"rows_kept":704,"cut":false,"hidden":true,"merged":[]}
["PWSID","name","county","basin","active","ibt",null,"Inside Water Rate first 5k Gal."]
["98-76-543","AAA-1 Water Authority (test)","Alamance","Albemarle Sound (12-1)",null,"No",null,{"$f":"VLOOKUP(B2&\"Water\"&\"Inside\",'EFC Table'!$A$3:$H$502,8,FALSE)","v":{"$error":"#N/A"}}]
["03-63-020","Aberdeen","Moore","Lumber River (09-1)","Yes","No",null,{"$f":"VLOOKUP(B3&\"Water\"&\"Inside\",'EFC Table'!$A$3:$H$502,8,FALSE)","v":24.55}]
["04-46-010","Ahoskie","Hertford","Chowan River (04-1)","Yes","No",null,{"$f":"VLOOKUP(B4&\"Water\"&\"Inside\",'EFC Table'!$A$3:$H$502,8,FALSE)","v":40.58}]
["02-01-035","Alamance","Alamance","Haw River (02-1)","Yes","No",null,{"$f":"VLOOKUP(B5&\"Water\"&\"Inside\",'EFC Table'!$A$3:$H$502,8,FALSE)","v":37.85}]
["01-84-010","Albemarle","Stanly","Yadkin River (18-1)","Yes","< 0.100 MGD",null,{"$f":"VLOOKUP(B6&\"Water\"&\"Inside\",'EFC Table'!$A$3:$H$502,8,FALSE)","v":27.46}]
["04-31-080","ALBERTSON WSD","Duplin","Northeast Cape Fear River (02-5)","No","No",null,{"$f":"VLOOKUP(B7&\"Water\"&\"Inside\",'EFC Table'!$A$3:$H$502,8,FALSE)","v":{"$error":"#N/A"}}]
["01-02-020","Alexander County WD","Alexander","Catawba River (03-1)","Yes","No",null,{"$f":"VLOOKUP(B8&\"Water\"&\"Inside\",'EFC Table'!$A$3:$H$502,8,FALSE)","v":{"$error":"#N/A"}}]
["01-20-020","Andrews","Cherokee","Hiwassee River (06-1)","Yes","No",null,{"$f":"VLOOKUP(B9&\"Water\"&\"Inside\",'EFC Table'!$A$3:$H$502,8,FALSE)","v":43}]
["03-43-015","Angier","Harnett","Cape Fear River (02-3)","Yes","< 0.100 MGD",null,{"$f":"VLOOKUP(B10&\"Water\"&\"Inside\",'EFC Table'!$A$3:$H$502,8,FALSE)","v":31.77}]
["03-04-010","Anson Co","Anson","Yadkin River (18-1)","Yes","< 0.100 MGD",null,{"$f":"VLOOKUP(B11&\"Water\"&\"Inside\",'EFC Table'!$A$3:$H$502,8,FALSE)","v":26.96}]
["03-04-012","Ansonville","Anson","Yadkin River (18-1)","Yes","< 0.100 MGD",null,{"$f":"VLOOKUP(B12&\"Water\"&\"Inside\",'EFC Table'!$A$3:$H$502,8,FALSE)","v":31.04}]
["03-92-045","Apex","Wake","Haw River (02-1)","Yes","< 0.100 MGD",null,{"$f":"VLOOKUP(B13&\"Water\"&\"Inside\",'EFC Table'!$A$3:$H$502,8,FALSE)","v":27.25}]
["01-95-101","Appalachian State University","Watauga","New River (11-1)","Yes","No",null,{"$f":"VLOOKUP(B14&\"Water\"&\"Inside\",'EFC Table'!$A$3:$H$502,8,FALSE)","v":{"$error":"#N/A"}}]
["04-65-226","APPLE VALLEY","New Hanover","Northeast Cape Fear River (02-5)","No","No",null,{"$f":"VLOOKUP(B15&\"Water\"&\"Inside\",'EFC Table'!$A$3:$H$502,8,FALSE)","v":{"$error":"#N/A"}}]
["02-76-030","Archdale","Randolph","Deep River (02-2)","Yes","< 0.100 MGD",null,{"$f":"VLOOKUP(B16&\"Water\"&\"Inside\",'EFC Table'!$A$3:$H$502,8,FALSE)","v":32.35}]
["02-99-030","ARLINGTON","Yadkin","Yadkin River (18-1)","No","No",null,{"$f":"VLOOKUP(B17&\"Water\"&\"Inside\",'EFC Table'!$A$3:$H$502,8,FALSE)","v":{"$error":"#N/A"}}]
["02-76-010","Asheboro","Randolph","Deep River (02-2)","Yes","< 0.100 MGD",null,{"$f":"VLOOKUP(B18&\"Water\"&\"Inside\",'EFC Table'!$A$3:$H$502,8,FALSE)","v":31.5}]
["01-11-010","Asheville","Buncombe","French Broad River (05-2)","Yes","No",null,{"$f":"VLOOKUP(B19&\"Water\"&\"Inside\",'EFC Table'!$A$3:$H$502,8,FALSE)","v":37.43}]
["04-16-035","Atlantic Beach","Carteret","White Oak River (17-1)","Yes","No",null,{"$f":"VLOOKUP(B20&\"Water\"&\"Inside\",'EFC Table'!$A$3:$H$502,8,FALSE)","v":29.65}]
{"$rows_left_out":684}