{"text_format":"1","workbook":"xlsx","n_sheets":24,"sheets":["Definitions","Definitions (Tutorial)","Data Collection Check List","Data Coll Check List (Tutorial)","Costs Check List","Costs Check List (Tutorial)","Rates Check List","Meter Error Calculation","Water Management Table","Rates Check List (Tutorial)","Meter Error Calc (Tutorial)","Water Mgmt Table (Tutorial)","Meter Error Table","Meter Error Table (Tutorial)","Cost to Produce Calculator","Cost to Produce Calc (Tutorial)","Retail Charge Calculator","Retail Charge Calc (Tutorial)","Water Management Chart","Notes","Water Mgmt Chart (Tutorial)","Notes (Tutorial)","Chart Data","Chart Data (Tutorial)"],"not_rendered":{"charts":4,"images":0,"macros":1,"external_links":0,"defined_names":5,"comments":10,"pivot_tables":0},"unopened":[{"sheet":"Water Management Chart","index":18,"reason":"not_a_worksheet"},{"sheet":"Water Mgmt Chart (Tutorial)","index":20,"reason":"not_a_worksheet"}],"bounds":{"document_bytes":16777216,"sheet_cells":100000,"rows_first":2000,"rows_last":500,"rows_between":2000,"halvings":0,"cell_chars":16384,"cell_head_chars":4096},"cells_cut":0,"cells_raw":0,"read":"whole","date_system":"1900"}

{"sheet":"Definitions","index":0,"n_rows":66,"n_cols":2,"rows_kept":66,"cut":false,"hidden":false,"merged":[[0,0,0,1]]}
["SMALL SYSTEM WATER AUDIT DEFINITIONS"]
[]
["WATER DELIVERED (Gal/Yr)"]
[" 1. Total Source Water Supply (Raw Water)","Total volume of water obtained from ground or surface water sources."]
["          Ground Water Sources","Water obtained from wells."]
["          Surface Water Sources","Water obtained from surface withdrawals."]
[" 2. Adjustments to Water Delivery","Total volume of water used at the plant that is not sent to the distribution system."]
["          Backwash water","Water used to clean out a clogged filter by reversing the flow of water."]
{"$rows_left_out":59}
{"sheet":"Definitions (Tutorial)","index":1,"n_rows":66,"n_cols":2,"rows_kept":66,"cut":false,"hidden":true,"merged":[[0,0,0,1],[2,0,2,1],[12,0,12,1],[40,0,40,1]]}
["SMALL SYSTEM WATER AUDIT DEFINITIONS (TUTORIAL)"]
[]
["WATER DELIVERED (Gal/Yr)"]
[" 1. Total Source Water Supply (Raw Water)","Total volume of water obtained from ground or surface water sources."]
["          Ground Water Sources","Water obtained from wells."]
["          Surface Water Sources","Water obtained from surface withdrawals."]
[" 2. Adjustments to Water Delivery","Total volume of water used at the plant that is not sent to the distribution system."]
["          Backwash water","Water used to clean out a clogged filter by reversing the flow of water."]
{"$rows_left_out":59}
{"sheet":"Data Collection Check List","index":2,"n_rows":49,"n_cols":5,"rows_kept":49,"cut":false,"hidden":false,"merged":[[12,6,12,7],[43,1,43,3],[3,1,3,3],[0,0,0,4],[1,0,1,4],[11,1,11,3],[19,1,19,3],[38,1,38,3]]}
["WATER AUDIT DATA COLLECTION WORKSHEET"]
["(Units should be reported in gallons per year, GPY)"]
[null,"Data Year:"]
["WATER DELIVERED (Gal/Yr)","Check Appropriate Box",null,null,"Enter Quantities In This Column"]
["Have I Collected the Following:","Yes","Metered","N/A"]
["Amount of raw ground water pumped"]
["Amount of raw surface water pumped"]
["Amount of finished water produced"]
{"$rows_left_out":42}
{"sheet":"Data Coll Check List (Tutorial)","index":3,"n_rows":49,"n_cols":5,"rows_kept":49,"cut":false,"hidden":true,"merged":[[12,6,12,7],[19,1,19,3],[38,1,38,3],[43,1,43,3],[0,0,0,4],[1,0,1,4],[3,1,3,3],[11,1,11,3]]}
["WATER AUDIT DATA COLLECTION WORKSHEET (TUTORIAL)"]
["(Units should be reported in gallons per year, GPY)"]
[null,"Data Year:",2021]
["WATER DELIVERED (Gal/Yr)","Check Appropriate Box",null,null,"Enter Quantities In This Column"]
["Have I Collected the Following:","Yes","Metered","N/A"]
["Amount of raw ground water pumped",null,"a",null,22630000]
["Amount of raw surface water pumped",null,"a",null,54500000]
["Amount of finished water produced"]
{"$rows_left_out":42}
{"sheet":"Costs Check List","index":4,"n_rows":21,"n_cols":4,"rows_kept":21,"cut":false,"hidden":false,"merged":[[2,1,2,2],[0,0,0,3]]}
["COSTS DATA COLLECTION WORKSHEET"]
[null,"Data Year:",{"$f":"IF('Data Collection Check List'!C3=\"\",\"No Data\",'Data Collection Check List'!C3)","v":"No Data"}]
["COST TO PRODUCE WATER (enter annual cost only)","Check Appropriate Column",null,"Enter Costs In This Column"]
["Have I Collected Data on Costs for Providing Safe Water:","Yes","N/A"]
["Electricity Cost",null,null,0]
["Chemical Cost",null,null,0]
["Chemical Cost",null,null,0]
["Chemical Analysis Cost",null,null,0]
{"$rows_left_out":14}
{"sheet":"Costs Check List (Tutorial)","index":5,"n_rows":21,"n_cols":4,"rows_kept":21,"cut":false,"hidden":true,"merged":[[0,0,0,3],[2,1,2,2]]}
["COSTS DATA COLLECTION WORKSHEET (TUTORIAL)"]
[null,"Data Year:",2021]
["COST TO PRODUCE WATER (enter annual cost only)","Check Appropriate Column",null,"Enter Costs In This Column"]
["Have I Collected Data on Costs for Providing Safe Water:","Yes","N/A"]
["Electricity Cost - describe as needed","a",null,155200]
["Chemical Cost - describe as needed","a",null,40000]
["Chemical Cost - describe as needed",null,null,0]
["Chemical Analysis Cost - describe as needed",null,null,0]
{"$rows_left_out":14}
{"sheet":"Rates Check List","index":6,"n_rows":12,"n_cols":5,"rows_kept":12,"cut":false,"hidden":false,"merged":[[6,0,6,1],[7,0,7,1],[8,0,8,1],[2,2,2,3],[0,0,0,4],[3,0,3,1],[2,0,2,1],[4,0,4,1],[5,0,5,1]]}
["WATER RATES DATA COLLECTION WORKSHEET"]
[null,null,"Data Year:",{"$f":"IF('Data Collection Check List'!C3=\"\",\"No Data\",'Data Collection Check List'!C3)","v":"No Data"}]
["RETAIL CHARGE FOR WATER",null,"Check Appropriate Column",null,"Enter Rates In This Column"]
["Have I Collected Data on Water Rates for:",null,"Yes","N/A","$/1,000 Gal."]
["Residential Customers",null,null,null,0]
["Commercial Customers",null,null,null,0]
["Industrial Customers",null,null,null,0]
["Institutional Customers",null,null,null,0]
{"$rows_left_out":5}
{"sheet":"Meter Error Calculation","index":7,"n_rows":177,"n_cols":8,"rows_kept":177,"cut":false,"hidden":false,"merged":[[175,0,175,1],[176,0,176,1],[0,0,0,5],[158,5,158,7],[75,0,75,7],[109,0,109,7],[144,0,144,7],[40,0,40,6],[89,5,89,7],[123,5,123,7],[67,0,67,1],[68,0,68,1],[106,0,106,1],[107,0,107,1],[140,0,140,1],[141,0,141,1]]}
["METER ERROR CALCULATION WORKSHEET"]
[]
["Data Year:",{"$f":"IF('Data Collection Check List'!C3=\"\",\"No Data\",'Data Collection Check List'!C3)","v":"No Data"}]
[]
["Month","Residential, Gal","Commercial, Gal","Industrial, Gal","Institutional, Gal","Total, Gal"]
["January",null,null,null,null,{"$f":"SUM(B6:E6)","v":0}]
["February",null,null,null,null,0]
["March",null,null,null,null,0]
{"$rows_left_out":170}
{"sheet":"Water Management Table","index":8,"n_rows":65,"n_cols":17,"rows_kept":65,"cut":false,"hidden":false,"merged":[[68,0,68,1],[6,14,6,16],[6,2,6,4],[6,11,6,13],[6,5,6,7],[6,8,6,10],[7,5,7,7],[7,2,7,4],[7,8,7,10],[7,11,7,13],[7,14,7,16],[13,0,13,1],[61,0,61,1],[62,0,62,1],[5,14,5,16],[5,0,5,1],[5,5,5,7],[5,8,5,10],[5,11,5,13]]}
["WATER SYSTEM AUDIT WORKSHEET"]
["(Units should be reported in gallons per year, gpy)"]
[]
["Enter values in non-shaded cells only."]
[]
["Cells with red triangles      contain information. Roll your pointer over the triangle to reveal the information."]
[null,null,2021,null,null,2022,null,null,2023,null,null,2024,null,null,2025]
["WATER DELIVERED (Gal/Yr)"]
{"$rows_left_out":58}
{"sheet":"Rates Check List (Tutorial)","index":9,"n_rows":13,"n_cols":5,"rows_kept":13,"cut":false,"hidden":true,"merged":[[10,0,10,1],[6,0,6,1],[7,0,7,1],[8,0,8,1],[9,0,9,1],[0,0,0,4],[3,2,3,3],[3,0,3,1],[4,0,4,1],[5,0,5,1]]}
["WATER RATES DATA COLLECTION WORKSHEET (TUTORIAL)"]
[]
[null,null,"Data Year:",2021]
["RETAIL CHARGE FOR WATER",null,"Check Appropriate Column",null,"Enter Rates In This Column"]
["Have I Collected Data on Water Rates for:",null,"Yes","N/A","$/1,000 Gal."]
["Residential Customers",null,"a",null,2.75]
["Commercial Customers",null,"a",null,3.75]
["Industrial Customers",null,"a",null,4.75]
{"$rows_left_out":6}
{"sheet":"Meter Error Calc (Tutorial)","index":10,"n_rows":177,"n_cols":8,"rows_kept":177,"cut":false,"hidden":true,"merged":[[175,0,175,1],[176,0,176,1],[144,0,144,7],[158,5,158,7],[0,0,0,5],[40,0,40,6],[75,0,75,7],[89,5,89,7],[109,0,109,7],[123,5,123,7],[67,0,67,1],[68,0,68,1],[106,0,106,1],[107,0,107,1],[140,0,140,1],[141,0,141,1]]}
["METER ERROR CALCULATION WORKSHEET (TUTORIAL)"]
[]
["Data Year:",2021]
[]
["Month","Residential, Gal","Commercial, Gal","Industrial, Gal","Institutional, Gal","Total, Gal"]
["January",11000000,1200000,182500,669000,13051500]
["February",11000000,1200000,182500,669000,13051500]
["March",11000000,1200000,182500,669000,13051500]
{"$rows_left_out":170}
{"sheet":"Water Mgmt Table (Tutorial)","index":11,"n_rows":65,"n_cols":17,"rows_kept":65,"cut":false,"hidden":true,"merged":[[5,14,5,16],[5,0,5,1],[5,2,5,4],[5,5,5,7],[5,8,5,10],[5,11,5,13],[6,14,6,16],[7,2,7,4],[7,5,7,7],[7,8,7,10],[7,11,7,13],[7,14,7,16],[69,0,69,1],[6,2,6,4],[6,5,6,7],[6,8,6,10],[6,11,6,13],[61,0,61,1],[62,0,62,1],[13,0,13,1]]}
["WATER SYSTEM AUDIT WORKSHEET (TUTORIAL)"]
["(Units should be reported in gallons per year, gpy)"]
[]
["Enter values in non-shaded cells only."]
[]
["Cells with red triangles      contain information. Roll your pointer over the triangle to reveal the information."]
[null,null,2021,null,null,2022,null,null,2023,null,null,2024,null,null,2025]
["WATER DELIVERED (Gal/Yr)"]
{"$rows_left_out":58}
{"sheet":"Meter Error Table","index":12,"n_rows":9,"n_cols":10,"rows_kept":9,"cut":false,"hidden":false,"merged":[[1,2,1,3],[1,4,1,5],[1,6,1,7],[1,8,1,9],[1,0,1,1]]}
[]
[2021,null,2022,null,2023,null,2024,null,2025]
["Meter Type","% Meter Error","Meter Type","% Meter Error","Meter Type","% Meter Error","Meter Type","% Meter Error","Meter Type","% Meter Error"]
["Residential",null,"Residential",null,"Residential",null,"Residential",null,"Residential"]
["Commercial",null,"Commercial",null,"Commercial",null,"Commercial",null,"Commercial"]
["Industrial",null,"Industrial",null,"Industrial",null,"Industrial",null,"Industrial"]
["Institutional",null,"Institutional",null,"Institutional",null,"Institutional",null,"Institutional"]
["Other Water Utilities",null,"Other Water Utilities",null,"Other Water Utilities",null,"Other Water Utilities",null,"Other Water Utilities"]
{"$rows_left_out":2}
{"sheet":"Meter Error Table (Tutorial)","index":13,"n_rows":13,"n_cols":10,"rows_kept":13,"cut":false,"hidden":true,"merged":[[5,0,5,1],[5,2,5,3],[5,4,5,5],[5,6,5,7],[5,8,5,9]]}
[]
[]
[]
[]
["(TUTORIAL)"]
[2021,null,2022,null,2023,null,2024,null,2025]
["Meter Type","% Meter Error","Meter Type","% Meter Error","Meter Type","% Meter Error","Meter Type","% Meter Error","Meter Type","% Meter Error"]
["Residential",2.4856096284667756E-2,"Residential",null,"Residential",null,"Residential",null,"Residential"]
{"$rows_left_out":6}
{"sheet":"Cost to Produce Calculator","index":14,"n_rows":17,"n_cols":20,"rows_kept":17,"cut":false,"hidden":false,"merged":[[1,5,1,7],[2,4,2,7],[2,0,2,3],[1,1,1,3],[1,17,1,19],[2,16,2,19],[1,9,1,11],[2,8,2,11],[1,13,1,15],[2,12,2,15]]}
[]
[null,2021,null,null,null,2022,null,null,null,2023,null,null,null,2024,null,null,null,2025]
["ANNUAL COST TO PRODUCE WATER",null,null,null,"ANNUAL COST TO PRODUCE WATER",null,null,null,"ANNUAL COST TO PRODUCE WATER",null,null,null,"ANNUAL COST TO PRODUCE WATER",null,null,null,"ANNUAL COST TO PRODUCE WATER"]
["Item:","Descriptor","Cost","Cost/1000 Gal.","Item:","Descriptor","Cost","Cost/1000 Gal.","Item:","Descriptor","Cost","Cost/1000 Gal.","Item:","Descriptor","Cost","Cost/1000 Gal.","Item:","Descriptor","Cost","Cost/1000 Gal."]
[{"$f":"'Costs Check List'!A5","v":"Electricity Cost"},null,0,{"$f":"IF('Water Management Table'!E$17>0,C5/(('Water Management Table'!E$17)/1000),0)","v":0},{"$f":"'Costs Check List'!A5","v":"Electricity Cost"},null,0,{"$f":"IF('Water Management Table'!H$17>0,G5/(('Water Management Table'!H$17)/1000),0)","v":0},{"$f":"'Costs Check List'!A5","v":"Electricity Cost"},null,0,{"$f":"IF('Water Management Table'!K$17>0,K5/(('Water Management Table'!K$17)/1000),0)","v":0},{"$f":"'Costs Check List'!A5","v":"Electricity Cost"},null,0,{"$f":"IF('Water Management Table'!N$17>0,O5/(('Water Management Table'!N$17)/1000),0)","v":0},{"$f":"'Costs Check List'!A5","v":"Electricity Cost"},null,0,{"$f":"IF('Water Management Table'!Q$17>0,S5/(('Water Management Table'!Q$17)/1000),0)","v":0}]
[{"$f":"'Costs Check List'!A6","v":"Chemical Cost"},null,0,{"$f":"IF('Water Management Table'!E$17>0,C6/(('Water Management Table'!E$17)/1000),0)","v":0},{"$f":"'Costs Check List'!A6","v":"Chemical Cost"},null,0,{"$f":"IF('Water Management Table'!H$17>0,G6/(('Water Management Table'!H$17)/1000),0)","v":0},{"$f":"'Costs Check List'!A6","v":"Chemical Cost"},null,0,{"$f":"IF('Water Management Table'!K$17>0,K6/(('Water Management Table'!K$17)/1000),0)","v":0},{"$f":"'Costs Check List'!A6","v":"Chemical Cost"},null,0,{"$f":"IF('Water Management Table'!N$17>0,O6/(('Water Management Table'!N$17)/1000),0)","v":0},{"$f":"'Costs Check List'!A6","v":"Chemical Cost"},null,0,{"$f":"IF('Water Management Table'!Q$17>0,S6/(('Water Management Table'!Q$17)/1000),0)","v":0}]
[{"$f":"'Costs Check List'!A7","v":"Chemical Cost"},null,0,{"$f":"IF('Water Management Table'!E$17>0,C7/(('Water Management Table'!E$17)/1000),0)","v":0},{"$f":"'Costs Check List'!A7","v":"Chemical Cost"},null,0,{"$f":"IF('Water Management Table'!H$17>0,G7/(('Water Management Table'!H$17)/1000),0)","v":0},{"$f":"'Costs Check List'!A7","v":"Chemical Cost"},null,0,{"$f":"IF('Water Management Table'!K$17>0,K7/(('Water Management Table'!K$17)/1000),0)","v":0},{"$f":"'Costs Check List'!A7","v":"Chemical Cost"},null,0,{"$f":"IF('Water Management Table'!N$17>0,O7/(('Water Management Table'!N$17)/1000),0)","v":0},{"$f":"'Costs Check List'!A7","v":"Chemical Cost"},null,0,{"$f":"IF('Water Management Table'!Q$17>0,S7/(('Water Management Table'!Q$17)/1000),0)","v":0}]
[{"$f":"'Costs Check List'!A8","v":"Chemical Analysis Cost"},null,0,{"$f":"IF('Water Management Table'!E$17>0,C8/(('Water Management Table'!E$17)/1000),0)","v":0},{"$f":"'Costs Check List'!A8","v":"Chemical Analysis Cost"},null,0,{"$f":"IF('Water Management Table'!H$17>0,G8/(('Water Management Table'!H$17)/1000),0)","v":0},{"$f":"'Costs Check List'!A8","v":"Chemical Analysis Cost"},null,0,{"$f":"IF('Water Management Table'!K$17>0,K8/(('Water Management Table'!K$17)/1000),0)","v":0},{"$f":"'Costs Check List'!A8","v":"Chemical Analysis Cost"},null,0,{"$f":"IF('Water Management Table'!N$17>0,O8/(('Water Management Table'!N$17)/1000),0)","v":0},{"$f":"'Costs Check List'!A8","v":"Chemical Analysis Cost"},null,0,{"$f":"IF('Water Management Table'!Q$17>0,S8/(('Water Management Table'!Q$17)/1000),0)","v":0}]
{"$rows_left_out":10}
{"sheet":"Cost to Produce Calc (Tutorial)","index":15,"n_rows":22,"n_cols":20,"rows_kept":22,"cut":false,"hidden":true,"merged":[[7,0,7,3],[7,4,7,7],[7,8,7,11],[7,12,7,15],[7,16,7,19],[6,1,6,3],[6,5,6,7],[6,9,6,11],[6,13,6,15],[6,17,6,19]]}
[]
[]
[]
[]
["(TUTORIAL)","Enter values in non-shaded cells only.",null,null,null,"Enter values in non-shaded cells only.",null,null,null,"Enter values in non-shaded cells only.",null,null,null,"Enter values in non-shaded cells only.",null,null,null,"Enter values in non-shaded cells only."]
[]
[null,2021,null,null,null,2022,null,null,null,2023,null,null,null,2024,null,null,null,2025]
["COST TO PRODUCE WATER (enter annual cost only)",null,null,null,"COST TO PRODUCE WATER (enter annual cost only)",null,null,null,"COST TO PRODUCE WATER (enter annual cost only)",null,null,null,"COST TO PRODUCE WATER (enter annual cost only)",null,null,null,"COST TO PRODUCE WATER (enter annual cost only)"]
{"$rows_left_out":15}
{"sheet":"Retail Charge Calculator","index":16,"n_rows":11,"n_cols":25,"rows_kept":11,"cut":false,"hidden":false,"merged":[[10,20,10,21],[10,10,10,11],[2,10,2,14],[3,15,3,16],[1,2,1,4],[1,7,1,9],[10,15,10,16],[8,5,8,6],[9,5,9,6],[4,10,4,11],[5,10,5,11],[6,10,6,11],[7,10,7,11],[8,10,8,11],[9,10,9,11],[4,15,4,16],[3,0,3,1],[10,5,10,6],[2,5,2,9],[10,0,10,1],[2,0,2,4],[3,5,3,6],[4,0,4,1],[5,0,5,1],[6,0,6,1],[7,0,7,1],[8,0,8,1],[9,0,9,1],[4,5,4,6],[5,5,5,6],[6,5,6,6],[7,5,7,6],[1,22,1,24],[2,20,2,24],[3,20,3,21],[3,10,3,11],[1,17,1,19],[1,12,1,14],[2,15,2,19],[5,15,5,16],[6,15,6,16],[7,15,7,16],[8,15,8,16],[9,15,9,16],[9,20,9,21],[4,20,4,21],[5,20,5,21],[6,20,6,21],[7,20,7,21],[8,20,8,21]]}
[]
[null,null,2021,null,null,null,null,2022,null,null,null,null,2023,null,null,null,null,2024,null,null,null,null,2025]
["RETAIL CHARGE FOR WATER",null,null,null,null,"RETAIL CHARGE FOR WATER",null,null,null,null,"RETAIL CHARGE FOR WATER",null,null,null,null,"RETAIL CHARGE FOR WATER",null,null,null,null,"RETAIL CHARGE FOR WATER"]
["Water Sold (Metered)",null,"Category Weight","$/1,000 Gal.","WT$/1000 Gal.","Water Sold (Metered)",null,"Category Weight","$/1,000 Gal.","WT$/1000 Gal.","Water Sold (Metered)",null,"Category Weight","$/1,000 Gal.","WT$/1000 Gal.","Water Sold (Metered)",null,"Category Weight","$/1,000 Gal.","WT$/1000 Gal.","Water Sold (Metered)",null,"Category Weight","$/1,000 Gal.","WT$/1000 Gal."]
["Residential",null,{"$f":"IF('Water Management Table'!E20>0,'Water Management Table'!E20/'Water Management Table'!$E$26,0)","v":0},0,{"$f":"C5*D5","v":0},"Residential",null,{"$f":"IF('Water Management Table'!H20>0,'Water Management Table'!H20/'Water Management Table'!$H$26,0)","v":0},0,{"$f":"H5*I5","v":0},"Residential",null,{"$f":"IF('Water Management Table'!K20>0,'Water Management Table'!K20/'Water Management Table'!$K$26,0)","v":0},0,{"$f":"M5*N5","v":0},"Residential",null,{"$f":"IF('Water Management Table'!N20>0,'Water Management Table'!N20/'Water Management Table'!$N$26,0)","v":0},0,{"$f":"R5*S5","v":0},"Residential",null,{"$f":"IF('Water Management Table'!Q20>0,'Water Management Table'!Q20/'Water Management Table'!$Q$26,0)","v":0},0,{"$f":"W5*X5","v":0}]
["Commercial",null,{"$f":"IF('Water Management Table'!E21>0,'Water Management Table'!E21/'Water Management Table'!$E$26,0)","v":0},0,0,"Commercial",null,{"$f":"IF('Water Management Table'!H21>0,'Water Management Table'!H21/'Water Management Table'!$H$26,0)","v":0},0,0,"Commercial",null,{"$f":"IF('Water Management Table'!K21>0,'Water Management Table'!K21/'Water Management Table'!$K$26,0)","v":0},0,0,"Commercial",null,{"$f":"IF('Water Management Table'!N21>0,'Water Management Table'!N21/'Water Management Table'!$N$26,0)","v":0},0,0,"Commercial",null,{"$f":"IF('Water Management Table'!Q21>0,'Water Management Table'!Q21/'Water Management Table'!$Q$26,0)","v":0},0,0]
["Industrial",null,{"$f":"IF('Water Management Table'!E22>0,'Water Management Table'!E22/'Water Management Table'!$E$26,0)","v":0},0,0,"Industrial",null,{"$f":"IF('Water Management Table'!H22>0,'Water Management Table'!H22/'Water Management Table'!$H$26,0)","v":0},0,0,"Industrial",null,{"$f":"IF('Water Management Table'!K22>0,'Water Management Table'!K22/'Water Management Table'!$K$26,0)","v":0},0,0,"Industrial",null,{"$f":"IF('Water Management Table'!N22>0,'Water Management Table'!N22/'Water Management Table'!$N$26,0)","v":0},0,0,"Industrial",null,{"$f":"IF('Water Management Table'!Q22>0,'Water Management Table'!Q22/'Water Management Table'!$Q$26,0)","v":0},0,0]
["Institutional",null,{"$f":"IF('Water Management Table'!E23>0,'Water Management Table'!E23/'Water Management Table'!$E$26,0)","v":0},0,0,"Institutional",null,{"$f":"IF('Water Management Table'!H23>0,'Water Management Table'!H23/'Water Management Table'!$H$26,0)","v":0},0,0,"Institutional",null,{"$f":"IF('Water Management Table'!K23>0,'Water Management Table'!K23/'Water Management Table'!$K$26,0)","v":0},0,0,"Institutional",null,{"$f":"IF('Water Management Table'!N23>0,'Water Management Table'!N23/'Water Management Table'!$N$26,0)","v":0},0,0,"Institutional",null,{"$f":"IF('Water Management Table'!Q23>0,'Water Management Table'!Q23/'Water Management Table'!$Q$26,0)","v":0},0,0]
{"$rows_left_out":4}
{"sheet":"Retail Charge Calc (Tutorial)","index":17,"n_rows":16,"n_cols":25,"rows_kept":16,"cut":false,"hidden":true,"merged":[[14,20,14,21],[9,20,9,21],[10,20,10,21],[11,20,11,21],[12,20,12,21],[13,20,13,21],[14,10,14,11],[9,15,9,16],[10,15,10,16],[11,15,11,16],[12,15,12,16],[13,15,13,16],[14,15,14,16],[9,10,9,11],[10,10,10,11],[11,10,11,11],[12,10,12,11],[13,10,13,11],[14,0,14,1],[9,5,9,6],[10,5,10,6],[11,5,11,6],[12,5,12,6],[13,5,13,6],[14,5,14,6],[9,0,9,1],[10,0,10,1],[11,0,11,1],[12,0,12,1],[13,0,13,1],[7,0,7,4],[7,5,7,9],[7,10,7,14],[7,15,7,19],[7,20,7,24],[6,2,6,4],[6,7,6,9],[6,12,6,14],[6,17,6,19],[6,22,6,24],[15,0,15,1],[15,5,15,6],[15,10,15,11],[15,15,15,16],[15,20,15,21],[8,0,8,1],[8,5,8,6],[8,10,8,11],[8,15,8,16],[8,20,8,21]]}
[]
[]
[]
[]
["(TUTORIAL)",null,"Enter values in non-shaded cells only.",null,null,null,null,"Enter values in non-shaded cells only.",null,null,null,null,"Enter values in non-shaded cells only.",null,null,null,null,"Enter values in non-shaded cells only.",null,null,null,null,"Enter values in non-shaded cells only."]
[]
[null,null,2021,null,null,null,null,2022,null,null,null,null,2023,null,null,null,null,2024,null,null,null,null,2025]
["RETAIL CHARGE FOR WATER",null,null,null,null,"RETAIL CHARGE FOR WATER",null,null,null,null,"RETAIL CHARGE FOR WATER",null,null,null,null,"RETAIL CHARGE FOR WATER",null,null,null,null,"RETAIL CHARGE FOR WATER"]
{"$rows_left_out":9}
{"sheet":"Notes","index":19,"n_rows":3,"n_cols":5,"rows_kept":3,"cut":false,"hidden":false,"merged":[]}
["This sheet can be used to take notes during the auditing process."]
[]
[2021,2022,2023,2024,2025]

{"sheet":"Notes (Tutorial)","index":21,"n_rows":3,"n_cols":5,"rows_kept":3,"cut":false,"hidden":true,"merged":[]}
["This sheet can be used to take notes during the auditing process."]
[]
[2021,2022,2023,2024,2025]

{"sheet":"Chart Data","index":22,"n_rows":4,"n_cols":8,"rows_kept":4,"cut":false,"hidden":true,"merged":[]}
[null,null,null,2021,2022,2023,2024,2025]
["Total  Non-Revenue Water (Gal)",null,null,{"$f":"'Water Management Table'!E58","v":0},{"$f":"'Water Management Table'!H58","v":0},{"$f":"'Water Management Table'!K58","v":0},{"$f":"'Water Management Table'!N58","v":0},{"$f":"'Water Management Table'!Q58","v":0}]
["Annual Cost of Apparent Losses",null,null,{"$f":"'Water Management Table'!E60","v":0},{"$f":"'Water Management Table'!H60","v":0},{"$f":"'Water Management Table'!K60","v":0},{"$f":"'Water Management Table'!N60","v":0},{"$f":"'Water Management Table'!Q60","v":0}]
["Annual Cost of Real Losses",null,null,{"$f":"'Water Management Table'!E61","v":0},{"$f":"'Water Management Table'!H61","v":0},{"$f":"'Water Management Table'!K61","v":0},{"$f":"'Water Management Table'!N61","v":0},{"$f":"'Water Management Table'!Q61","v":0}]

{"sheet":"Chart Data (Tutorial)","index":23,"n_rows":4,"n_cols":8,"rows_kept":4,"cut":false,"hidden":true,"merged":[]}
[null,null,null,2016,2017,2018,2019,2020]
["Total  Non-Revenue Water (Gal)",null,null,45485000,0,0,0,0]
["Annual Cost of Apparent Losses",null,null,49226.410852298934,0,0,0,0]
["Annual Cost of Real Losses",null,null,44803.964432824992,0,0,0,0]